Cadin-3-en-10-β-ol
- Formula: C15H26O
- Molecular weight: 222.3663
- IUPAC Standard InChIKey: INTCVZZCTDGTCB-BOADVZGGSA-N
- Chemical structure:
View 3d structure (requires JavaScript / HTML 5) - Stereoisomers:

Van Den Dool and Kratz RI, non-polar column, temperature ramp

Column type | Active phase | I | Reference | Comment |
---|---|---|---|---|
Capillary | DB-5 | 1691. | Queiroga, Ferracini, et al., 1996 | 30. m/0.25 mm/0.25 μm, H2, 2. K/min; Tstart: 105. C; Tend: 280. C |

References

Queiroga, Ferracini, et al., 1996
Queiroga, C.L.; Ferracini, V.L.; Marsaioli, A.J.,
Three new oxygenated cadinanes from Baccharis species,
Phytochemistry, 1996, 42, 4, 1097-1103, https://doi.org/10.1016/0031-9422(95)00977-9
. [all data]