5-Cholesten-3-β,7-α,12-α,24,25-pentol, TMS, # 1

Normal alkane RI, non-polar column, temperature ramp

View large format table.

Column type Active phase I Reference Comment
CapillaryMethyl Silicone3499.Ichimiya, Egestad, et al., 199125. m/0.32 mm/0.25 μm, He, 25. K/min; Tstart: 80. C; Tend: 280. C

References

Ichimiya, Egestad, et al., 1991
Ichimiya, H.; Egestad, B.; Nazer, H.; Baginski, E.S.; Clayton, P.T.; Sjövall, J., Bile acids and bile alcohols in a child with hepatic 3β-hydroxy-Δ5-C27-steroid dehydrogenase deficiency: effects of chenodeoxycholic acid treatment, J. Lipid Res., 1991, 32, 829-841. [all data]