[2H9]-1-(Chloromethyl)-4-methylbenzene
- Formula: C8D9Cl
- Molecular weight: 149.666
- IUPAC Standard InChIKey: DMHZDOTYAVHSEH-SRDZSKBCSA-N
- Chemical structure:
View 3d structure (requires JavaScript / HTML 5) - Isotopologues:

Kovats' RI, non-polar column, isothermal

Column type | Active phase | Temperature (C) | I | Reference | Comment |
---|---|---|---|---|---|
Capillary | SE-54 | 115. | 1130. | Bermejo, Blanco, et al., 1986 | N2; Column length: 25. m; Column diameter: 0.22 mm |
Capillary | Squalane | 115. | 1074. | Bermejo, Blanco, et al., 1986 | N2; Column length: 45. m; Column diameter: 0.5 mm |

References

Bermejo, Blanco, et al., 1986
Bermejo, J.; Blanco, C.G.; Guillén, M.D.,
Gas chromatography of deuterated and protiated chloro derivatives of 1,4-dimethylbenzene,
J. Chromatogr., 1986, 351, 425-432, https://doi.org/10.1016/S0021-9673(01)83520-2
. [all data]