[2H8]-1,4-Bis(chloromethyl)benzene
- Formula: C8D8Cl2
- Molecular weight: 183.104
- IUPAC Standard InChIKey: ZZHIDJWUJRKHGX-MOBLDEHESA-N
- Chemical structure:
View 3d structure (requires JavaScript / HTML 5) - Isotopologues:

Kovats' RI, non-polar column, isothermal

Column type | Active phase | Temperature (C) | I | Reference | Comment |
---|---|---|---|---|---|
Capillary | SE-54 | 115. | 1381. | Bermejo, Blanco, et al., 1986 | N2; Column length: 25. m; Column diameter: 0.22 mm |
Capillary | Squalane | 115. | 1288. | Bermejo, Blanco, et al., 1986 | N2; Column length: 45. m; Column diameter: 0.5 mm |

References

Bermejo, Blanco, et al., 1986
Bermejo, J.; Blanco, C.G.; Guillén, M.D.,
Gas chromatography of deuterated and protiated chloro derivatives of 1,4-dimethylbenzene,
J. Chromatogr., 1986, 351, 425-432, https://doi.org/10.1016/S0021-9673(01)83520-2
. [all data]