Dicyclopentadiene, 9,10-dihydro, endo
- Formula: C10H14
- Molecular weight: 134.2182
- IUPAC Standard InChIKey: HANKSFAYJLDDKP-BMNUFHGDSA-N
- Chemical structure:
View 3d structure (requires JavaScript / HTML 5) - Species with the same structure:
- Stereoisomers:

Kovats' RI, non-polar column, isothermal

Column type | Active phase | Temperature (C) | I | Reference | Comment |
---|---|---|---|---|---|
Capillary | Squalane | 60. | 1038. | Stopp, Engewald, et al., 1978 | Column length: 70. m; Column diameter: 0.23 mm |

References

Stopp, Engewald, et al., 1978
Stopp, I.; Engewald, W.; Kühn, H.; Welsch, Th.,
Molekülstruktur und retentionsverhalten. VIII. Zum gaschromatographischen retentionsverhalten von dicyclopentadienderivaten,
J. Chromatogr., 1978, 147, 21-30, https://doi.org/10.1016/S0021-9673(00)85113-4
. [all data]