endo-Tricyclo[6,2,1,0(2,6)]dec-3-en-8-β-ol, acetate
- Formula: C12H16O2
- Molecular weight: 192.2542
- IUPAC Standard InChIKey: RGVQNSFGUOIKFF-SEIUWDOFSA-N
- Chemical structure:
View 3d structure (requires JavaScript / HTML 5) - Stereoisomers:

Kovats' RI, non-polar column, isothermal

Column type | Active phase | Temperature (C) | I | Reference | Comment |
---|---|---|---|---|---|
Capillary | OV-1 | 140. | 1401. | Stopp, Engewald, et al., 1978 | Column length: 50. m; Column diameter: 0.30 mm |

Kovats' RI, polar column, isothermal

Column type | Active phase | Temperature (C) | I | Reference | Comment |
---|---|---|---|---|---|
Capillary | Carbowax 20M | 140. | 1870. | Stopp, Engewald, et al., 1978 | Column length: 50. m; Column diameter: 0.23 mm |

References

Stopp, Engewald, et al., 1978
Stopp, I.; Engewald, W.; Kühn, H.; Welsch, Th.,
Molekülstruktur und retentionsverhalten. VIII. Zum gaschromatographischen retentionsverhalten von dicyclopentadienderivaten,
J. Chromatogr., 1978, 147, 21-30, https://doi.org/10.1016/S0021-9673(00)85113-4
. [all data]