1,2-bis-[2-(Diisopropylamino)ethylthio] ethane
- Formula: C18H40N2S2
- Molecular weight: 348.654
- IUPAC Standard InChIKey: ZZGOPHQDWOJBGM-UHFFFAOYSA-N
- Chemical structure:
View 3d structure (requires JavaScript / HTML 5) - Other names: Ethane, 1,2-bis-(2-diisopropylaminoethylthio); Ethane, 1,2-bis[2-(diisopropylamino)ethyl]

Van Den Dool and Kratz RI, non-polar column, temperature ramp

Column type | Active phase | I | Reference | Comment |
---|---|---|---|---|
Capillary | OV-1 | 2310. | Kostiainen, 2000 | 15. m/0.32 mm/0.25 μm, He, 50. C @ 2. min, 10. K/min, 280. C @ 10. min |
Capillary | SE-54 | 2338.7 | Kostiainen, 2000 | 25. m/0.32 mm/0.25 μm, He, 40. C @ 1. min, 10. K/min, 280. C @ 10. min |
Capillary | DB-1 | 2310. | D'agostino, Provost, et al., 1987 | 15. m/0.32 mm/0.25 μm, He, 50. C @ 2. min, 10. K/min, 280. C @ 10. min |
Capillary | DB-5 | 2338.7 | D'agostino, Provost, et al., 1987 | 15. m/0.32 mm/0.25 μm, He, 50. C @ 2. min, 10. K/min, 280. C @ 10. min |

Normal alkane RI, non-polar column, temperature ramp

Column type | Active phase | I | Reference | Comment |
---|---|---|---|---|
Capillary | DB-5 | 2310. | Savel'eva, Zenkevich, et al., 2003 | 25. m/0.20 mm/0.33 μm, Helium, 40. C @ 1. min, 5. K/min, 270. C @ 15. min |

References

Kostiainen, 2000
Kostiainen, O.,
Gas Chromatography in Screening of Chemicals Related to the Chemical Weapons Convention
in Encyclopedia of Analytical Chemistry, Meyers, R.A., ed(s)., John Wiley Sons Ltd, Chichester, 2000, 963-979. [all data]
D'agostino, Provost, et al., 1987
D'agostino, P.A.; Provost, L.R.; Visentini, J.,
Analysis of O-Ethyl S-[2-(Diisopropylamino)ethyl] Methylphosphonothiolate (VX) by Capillary Column Gas Chromatography-Mass Spectrometry,
J. Chromatogr., 1987, 402, 221-232, https://doi.org/10.1016/0021-9673(87)80020-1
. [all data]
Savel'eva, Zenkevich, et al., 2003
Savel'eva, E.I.; Zenkevich, I.G.; Radilov, A.S.,
Identification the Products of Chemical Neutralization of O-Isobutyl-S-(2-diethylaminoethyl)methylthiophosphonate in the Composition of Bitumen-Salt Matrices,
Zh. Anal. Khim. (Rus.), 2003, 58, 2, 135-145. [all data]