Nonane, 4-ethyl

Kovats' RI, non-polar column, isothermal

View large format table.

Column type Active phase Temperature (C) I Reference Comment
CapillarySqualane100.1052.Mitra, Mohan, et al., 1974H2; Column length: 50. m; Column diameter: 0.2 mm
CapillaryApiezon L100.1044.Rappoport and Gäumann, 1973
PackedSE-3070.1047.Widmer, 1967Diatoport S; Column length: 7.9 m
PackedSE-3070.1047.Widmer, 1967Diatoport S; Column length: 7.9 m

Kovats' RI, polar column, isothermal

View large format table.

Column type Active phase Temperature (C) I Reference Comment
PackedCarbowax 20M130.1041.Widmer, 1967Diatoport P; Column length: 7.9 m
PackedCarbowax 20M70.1041.Widmer, 1967Diatoport P; Column length: 7.9 m

References

Mitra, Mohan, et al., 1974
Mitra, G.D.; Mohan, G.; Sinha, A., Gas chromatographic analysis of complex hydrocarbon mixtures, J. Chromatogr. A, 1974, 91, 633-648, https://doi.org/10.1016/S0021-9673(01)97944-0 . [all data]

Rappoport and Gäumann, 1973
Rappoport, S.; Gäumann, T., 114. L'indice de rétention des alcanes isomères en chromatographie en phase gazeuse, Helv. Chim. Acta, 1973, 56, 3, 1145-1158, https://doi.org/10.1002/hlca.19730560338 . [all data]

Widmer, 1967
Widmer, H., Gas chromatographic identification of hydrocarbons using retention indices, J. Gas Chromatogr., 1967, 5, 10, 506-510, https://doi.org/10.1093/chromsci/5.10.506 . [all data]