2-Phenylethyl 3-chlorobenzoate
- Formula: C15H13ClO2
- Molecular weight: 260.716
- IUPAC Standard InChIKey: HVYMOPGTMRUTRG-UHFFFAOYSA-N
- Chemical structure:
View 3d structure (requires JavaScript / HTML 5) - Other names: Benzoic acid, 3-chloro, 2-phenylethyl ester

Kovats' RI, non-polar column, isothermal

Column type | Active phase | Temperature (C) | I | Reference | Comment |
---|---|---|---|---|---|
Capillary | SE-30 | 140. | 1945. | Korhonen, 1986 | N2; Column length: 25. m; Column diameter: 0.33 mm |
Capillary | SE-30 | 160. | 1962. | Korhonen, 1986 | N2; Column length: 25. m; Column diameter: 0.33 mm |
Capillary | SE-30 | 180. | 1978. | Korhonen, 1986 | N2; Column length: 25. m; Column diameter: 0.33 mm |
Capillary | SE-30 | 200. | 1993. | Korhonen, 1986 | N2; Column length: 25. m; Column diameter: 0.33 mm |
Capillary | SE-30 | 220. | 2007. | Korhonen, 1986 | N2; Column length: 25. m; Column diameter: 0.33 mm |
Capillary | SE-30 | 240. | 2024. | Korhonen, 1986 | N2; Column length: 25. m; Column diameter: 0.33 mm |
Capillary | SE-30 | 180. | 1978. | Korhonen, 1986 | N2; Column length: 25. m; Column diameter: 0.33 mm |

Kovats' RI, polar column, isothermal

Column type | Active phase | Temperature (C) | I | Reference | Comment |
---|---|---|---|---|---|
Capillary | OV-351 | 180. | 2841. | Korhonen, 1986 | N2; Column length: 25. m; Column diameter: 0.32 mm |
Capillary | OV-351 | 200. | 2873. | Korhonen, 1986 | N2; Column length: 25. m; Column diameter: 0.32 mm |
Capillary | OV-351 | 220. | 2905. | Korhonen, 1986 | N2; Column length: 25. m; Column diameter: 0.32 mm |
Capillary | OV-351 | 180. | 2841. | Korhonen, 1986 | N2; Column length: 25. m; Column diameter: 0.32 mm |

Van Den Dool and Kratz RI, non-polar column, temperature ramp

Column type | Active phase | I | Reference | Comment |
---|---|---|---|---|
Capillary | SE-30 | 1977. | Korhonen, 1986 | N2, 6. K/min; Column length: 25. m; Column diameter: 0.33 mm; Tstart: 100. C |
Capillary | SE-30 | 1990. | Korhonen, 1986 | N2, 10. K/min; Column length: 25. m; Column diameter: 0.33 mm; Tstart: 50. C |

Van Den Dool and Kratz RI, polar column, temperature ramp

Column type | Active phase | I | Reference | Comment |
---|---|---|---|---|
Capillary | OV-351 | 2888. | Korhonen, 1986 | N2, 10. K/min; Column length: 25. m; Column diameter: 0.32 mm; Tstart: 50. C; Tend: 220. C |
Capillary | OV-351 | 2869. | Korhonen, 1986 | N2, 6. K/min; Column length: 25. m; Column diameter: 0.32 mm; Tstart: 50. C; Tend: 220. C |

References

Korhonen, 1986
Korhonen, I.O.O.,
Gas-Liquid Chromatographic Analyses. XLVIII. Benzyl, (±)-1-Phenylethyl and 2-Phenylethyl Alcohols and the Corresponding Esters of Benzoic Acid and Its 2-, 3- and 4-Chloro, Pentafluoro, 4-Nitro and 3,5-Dinitro Derivatives on SE-30 and OV-351 Capillary Columns,
J. Chromatogr., 1986, 363, 277-292. [all data]