Octane, perfluoro-1,8-dihydro
- Formula: C8H2F16
- Molecular weight: 402.0759
- IUPAC Standard InChIKey: JCRVQXKRULILSR-UHFFFAOYSA-N
- Chemical structure:
View 3d structure (requires JavaScript / HTML 5) - Permanent link for this species. Use this link for bookmarking this species for future reference.

Normal alkane RI, non-polar column, temperature ramp

Column type | Active phase | I | Reference | Comment |
---|---|---|---|---|
Capillary | OV-101 | 632. | Zenkevich, 2008 | 25. m/0.25 mm/0.20 μm, Nitrogen, 60. C @ 0. min, 6. K/min, 240. C @ 0. min |

References

Zenkevich, 2008
Zenkevich, I.G.,
Experimental data, Personal communication, 2008. [all data]