Benzene, 1-chloro-3-trifluoroacetyl
- Formula: C8H4ClF3O
- Molecular weight: 208.565
- IUPAC Standard InChIKey: KYFMLRJTDPGABF-UHFFFAOYSA-N
- Chemical structure:
View 3d structure (requires JavaScript / HTML 5) - Other names: Acetophenone, 3'-chloro, 2,2,2-trifluoro

Normal alkane RI, non-polar column, temperature ramp

Column type | Active phase | I | Reference | Comment |
---|---|---|---|---|
Capillary | OV-101 | 1012. | Zenkevich, 2008 | 25. m/0.25 mm/0.20 μm, Nitrogen, 60. C @ 0. min, 6. K/min, 240. C @ 0. min |
Capillary | OV-101 | 1011. | Zenkevich, Eliseenkov, et al., 2006 | Nitrogen, 6. K/min, 240. C @ 10. min; Column length: 25. m; Column diameter: 0.20 mm; Tstart: 60. C |

References

Zenkevich, 2008
Zenkevich, I.G.,
Experimental data, Personal communication, 2008. [all data]
Zenkevich, Eliseenkov, et al., 2006
Zenkevich, I.G.; Eliseenkov, E.V.; Kasatochkin, A.N.,
Application of Retention Indices in GC-MS Identification of Halogenated Organic Compounds,
Mass Spectromery (Rus.), 2006, 3, 2, 131-140. [all data]