13-ethoxy-8 α,13-epoxy-14,15,16-trinorlabdane

Normal alkane RI, polar column, temperature ramp

Data compiled by: NIST Mass Spectrometry Data Center, William E. Wallace, director

Column type CapillaryCapillary
Active phase PEG-20MPEG-20M
Column length (m) 60.60.
Carrier gas N2N2
Substrate
Column diameter (mm) 0.250.25
Phase thickness (μm)
Tstart (C) 70.70.
Tend (C) 220.220.
Heat rate (K/min) 3.3.
Initial hold (min)
Final hold (min)
I 2464.2556.
ReferenceAwano, Ishizaki, et al., 2005Awano, Ishizaki, et al., 2005
Comment MSDC-RI MSDC-RI

References

Awano, Ishizaki, et al., 2005
Awano, K.; Ishizaki, S.; Takazawa, O.; Kitahara, T., Analysis of ambergris tincture, Flavour Fragr. J., 2005, 20, 1, 18-21, https://doi.org/10.1002/ffj.1413 . [all data]