trans-p-menth-1-ene-3,8-diol
- Formula: C10H18O2
- Molecular weight: 170.2487
- IUPAC Standard InChIKey: MUTBSGZZTDPVPZ-RKDXNWHRSA-N
- Chemical structure:
View 3d structure (requires JavaScript / HTML 5) - Stereoisomers:

Normal alkane RI, non-polar column, temperature ramp

Column type | Active phase | I | Reference | Comment |
---|---|---|---|---|
Capillary | DB-1 | 1330. | Ueno, Masuda, et al., 2004 | 60. m/0.25 mm/0.25 μm, N2, 3. K/min, 210. C @ 15. min; Tstart: 80. C |

References

Ueno, Masuda, et al., 2004
Ueno, T.; Masuda, H.; Ho, C.-T.,
Formation mechanism of p-methylacetophenone from citral via a tert-alkoxy radical intermediate,
J. Agric. Food Chem., 2004, 52, 18, 5677-5684, https://doi.org/10.1021/jf035517j
. [all data]