(Z)-4-Phenylbut-3-en-2-one
- Formula: C10H10O
- Molecular weight: 146.1858
- IUPAC Standard InChIKey: BWHOZHOGCMHOBV-FPLPWBNLSA-N
- Chemical structure:
View 3d structure (requires JavaScript / HTML 5) - Stereoisomers:

Normal alkane RI, non-polar column, temperature ramp

Column type | Active phase | I | Reference | Comment |
---|---|---|---|---|
Capillary | DB-5 | 1261. | Mevy, Bessiere, et al., 2004 | 30. m/0.25 mm/0.15 μm, 60. C @ 3. min, 3. K/min; Tend: 220. C |

References

Mevy, Bessiere, et al., 2004
Mevy, J.P.; Bessiere, J.M.; Pelissier, Y.; Masotti, V.; Ruzzier, M.; Rabier, J.; Viano, J.,
Composition of the volatile constituents of the aerial parts of an endemic plant of Ivory Coast, Monanthotaxis capea (E.G. A. Camus) Verdc,
Flavour Fragr. J., 2004, 19, 6, 526-528, https://doi.org/10.1002/ffj.1329
. [all data]