(E)-1,5-octadien-3-one
- Formula: C8H12O
- Molecular weight: 124.1803
- IUPAC Standard InChIKey: VWYBQOFZVSNDAW-AATRIKPKSA-N
- Chemical structure:
View 3d structure (requires JavaScript / HTML 5) - Species with the same structure:
- Stereoisomers:

Normal alkane RI, non-polar column, custom temperature program

Column type | Active phase | I | Reference | Comment |
---|---|---|---|---|
Capillary | DB-5 | 988. | Acree and Arn, 2004 | Program: not specified |

References

Acree and Arn, 2004
Acree, T.; Arn, H.,
Flavornet, 2004, retrieved from http://www.flavornet.org/. [all data]