2,3-Butanediol, monopacetate, erythro
- Formula: C6H12O3
- Molecular weight: 132.1577
- IUPAC Standard InChIKey: BCWWODMTUXMSAB-CRCLSJGQSA-N
- Chemical structure:
View 3d structure (requires JavaScript / HTML 5) - Stereoisomers:

Normal alkane RI, non-polar column, temperature ramp

Column type | Active phase | I | Reference | Comment |
---|---|---|---|---|
Capillary | OV-101 | 920. | Zenkevich, 2003 | Nitrogen, 60. C @ 0. min, 6. K/min, 200. C @ 0. min; Column length: 25. m; Column diameter: 0.25 mm |

References

Zenkevich, 2003
Zenkevich, I.G. Kostikov,
Prediction of the Gas Chromatographic Elution Order of Diastereomers and Enantiomers using Molecular Dynamics Methods,
Zh. Org. Khim. (Rus.), 2003, 39, 8, 1127-1134. [all data]