Hydroxylamine, O-pentafluorobenzoyl
- Formula: C6H2F5NO
- Molecular weight: 199.0782
- IUPAC Standard InChIKey: AUPSECUITDVBHD-UHFFFAOYSA-N
- Chemical structure:
View 3d structure (requires JavaScript / HTML 5) - Permanent link for this species. Use this link for bookmarking this species for future reference.

Normal alkane RI, non-polar column, custom temperature program

Column type | Active phase | I | Reference | Comment |
---|---|---|---|---|
Capillary | Polydimethyl siloxanes | 1068. | Zenkevich, 2001 | Program: not specified |

References

Zenkevich, 2001
Zenkevich, I.G.,
Encyclopedia of Chromatography. Derivatization of Carbonyls for GC Analysis, MArcel Dekker, Inc., New York - Basel, 2001, 233. [all data]