Iso-3-Thujol
- Formula: C10H18O
- Molecular weight: 154.2493
- IUPAC Standard InChIKey: DZVXRFMREAADPP-KYXWUPHJSA-N
- Chemical structure:
View 3d structure (requires JavaScript / HTML 5) - Species with the same structure:
- Stereoisomers:
- neo-Isothujan-3-ol
- Bicyclo[3.1.0]hexan-3-ol, 4-methyl-1-(1-methylethyl)-, [1S-(1α,3α,4α,5α)]-
- Bicyclo[3.1.0]hexan-3-ol, 4-methyl-1-(1-methylethyl)-, (1α,3β,4β,5α)-
- Thujol
- Bicyclo[3.1.0]hexan-3-ol, 4-methyl-1-(1-methylethyl)-
- (1S,3S,4S,5R)-1-Isopropyl-4-methylbicyclo[3.1.0]hexan-3-ol
- cis-Thujanol
- Neo-3-Thujol
- Neo iso-3-Thujol
- neo-iso-Thujanol
- iso-3-Thujanol

Normal alkane RI, non-polar column, custom temperature program

Column type | Active phase | I | Reference | Comment |
---|---|---|---|---|
Capillary | Polydimethyl siloxanes | 1110. | Zenkevich, 1997 | Program: not specified |

References

Zenkevich, 1997
Zenkevich, I.G.,
Analytical Parameters of Components of Essential Oils for their Chromatographic and Chromato-Spectral Identificaiton. Oxsigenated derivatives of Mono- and Sesquiterpene Hydrocarbons,
Rastit, Resursy (Rus.), 1997, 33, 1, 16-28. [all data]