2-methylbutyl 2-methylbutanoate-d-3
- Formula: C10H17D3O2
- Molecular weight: 175.2831
- IUPAC Standard InChIKey: PVYFCGRBIREQLL-BMSJAHLVSA-N
- Chemical structure:

Kovats' RI, polar column, custom temperature program

Column type | Active phase | I | Reference | Comment |
---|---|---|---|---|
Capillary | Carbowax | 1283. | Rowan, Lane, et al., 1996 | 30. m/0.25 mm/0.25 μm; Program: 40C (10min) => 3C/min => 100C => 5C/min => 220C |

References

Rowan, Lane, et al., 1996
Rowan, D.D.; Lane, H.P.; Allen, J.M.; Fielder, S.; Hunt, M.B.,
Biosynthesis of 2-methylbutyl, 2-methyl-2-butenyl, and 2-methylbutanoate esters in Red Delicious and Granny Smith apples using deuterium-labeled substrates,
J. Agric. Food Chem., 1996, 44, 10, 3276-3285, https://doi.org/10.1021/jf9508209
. [all data]