Androst-4-en-4-chloro-3α-ol-17-one, TMS
- Formula: C25H43ClO2Si2
- Molecular weight: 467.232
- IUPAC Standard InChIKey: SHTZVTGOIGPTHA-CJJLFJDWSA-N
- Chemical structure:

Normal alkane RI, non-polar column, custom temperature program

Column type | Active phase | I | Reference | Comment |
---|---|---|---|---|
Capillary | DB-1 | 2720. | Bowers and Borts, 1996 | 30. m/0.25 mm/0.1 μm, He; Program: 170C => 20C/min => 260C => 2.7C/min => 305C => 20C/min => 320C |
Capillary | BPX-5 | 2736. | Bowers and Borts, 1996 | 30. m/0.22 mm/0.25 μm, He; Program: 170C => 20C/min => 260C => 2.7C/min => 305C => 20C/min => 320C |

References

Bowers and Borts, 1996
Bowers, L.D.; Borts, D.J.,
Separation and confirmation of anabolic steroids with quadrupole ion trap tandem mass spectrometry,
J. Chromatogr. B, 1996, 687, 1, 69-78, https://doi.org/10.1016/S0378-4347(96)00231-9
. [all data]