linalool oxide II
- Formula: C10H16O
- Molecular weight: 152.2334
- IUPAC Standard InChIKey: XIGFNCYVSHOLIF-VHSXEESVSA-N
- Chemical structure:
View 3d structure (requires JavaScript / HTML 5) - Species with the same structure:
- Stereoisomers:

Normal alkane RI, non-polar column, custom temperature program

Column type | Active phase | I | Reference | Comment |
---|---|---|---|---|
Capillary | CP-Sil | 1088. | Proffit, 2007 | 30. m/0.25 mm/0.25 μm, Helium; Program: 50 0C (3 min) 3 0C/min -> 100 0C 2.7 0C/min -> 140 0C 2.4 0C/min -> 180 0C 6 0C/min -> 250 0C |

Normal alkane RI, polar column, temperature ramp

Column type | Active phase | I | Reference | Comment |
---|---|---|---|---|
Capillary | PEG-20M | 1470. | Yao, Guo, et al., 2005 | 60. C @ 10. min, 3. K/min, 180. C @ 30. min; Column length: 30. m; Column diameter: 0.25 mm |
Capillary | PEG-20M | 1442. | Togari, Kobayashi, et al., 1995 | 50. m/0.25 mm/0.15 μm, He, 60. C @ 4. min, 2. K/min; Tend: 180. C |

References

Proffit, 2007
Proffit, M.,
Mediation chimique et structuration des communautes d'hymenopteres parasites du mutualisme figuier / pollinisateur (These pour obtenir le grade de Docteur de l'Universite Montpellier II) (Dissertation), 2007. [all data]
Yao, Guo, et al., 2005
Yao, S.-S.; Guo, W.-F.; Lu, Y.; Jiang, Y.-X.,
Flavor Characteristics of Lapsang Souchong and Smoked Lapsang Souchong, a Special Chinese Black Tea with Pine Smoking Process,
J. Agric. Food Chem., 2005, 53, 22, 8688-8693, https://doi.org/10.1021/jf058059i
. [all data]
Togari, Kobayashi, et al., 1995
Togari, N.; Kobayashi, A.; Aishima, T.,
Pattern recognition applied to gas chromatographic profiles of volatile components in three tea categories,
Food Res. Int., 1995, 28, 5, 495-502, https://doi.org/10.1016/0963-9969(95)00029-1
. [all data]