p-Menth-1-en-3,8-diol, trans
- Formula: C10H18O2
- Molecular weight: 170.2487
- IUPAC Standard InChIKey: MUTBSGZZTDPVPZ-IUCAKERBSA-N
- Chemical structure:
View 3d structure (requires JavaScript / HTML 5) - Stereoisomers:

Normal alkane RI, non-polar column, temperature ramp

Column type | Active phase | I | Reference | Comment |
---|---|---|---|---|
Capillary | SE-30 | 1340. | Peacock and Kuneman, 1985 | N2, 45. C @ 1. min, 4. K/min; Column length: 100. m; Column diameter: 0.25 mm; Tend: 250. C |

References

Peacock and Kuneman, 1985
Peacock, V.E.; Kuneman, D.W.,
Inhibition of the formation of α-p-dimethylstyrene and p-cymen-8-ol in a carbonated citral-containing beverage system,
J. Agric. Food Chem., 1985, 33, 3, 330-335, https://doi.org/10.1021/jf00063a003
. [all data]