α-Isopropoxystyrene

Normal alkane RI, non-polar column, temperature ramp

Data compiled by: NIST Mass Spectrometry Data Center, William E. Wallace, director

Column type Capillary
Active phase OV-101
Column length (m) 54.
Carrier gas Helium
Substrate
Column diameter (mm) 0.26
Phase thickness (μm)
Tstart (C) 50.
Tend (C) 220.
Heat rate (K/min) 3.
Initial hold (min) 0.
Final hold (min) 0.
I 1193.
ReferenceMandelshtam, Kharicheva, et al., 1991
Comment MSDC-RI

References

Mandelshtam, Kharicheva, et al., 1991
Mandelshtam, T.V.; Kharicheva, E.M.; Gorobets, I.A.; Zenkevich, I.G.; Kostikov, R.R.; Porokhovnikova, E.B., Synthesis and Chromato Mass Spectrometric Investigation of alpha-Alkoxystyrenes, Zh. Org. Khim. (Rus.), 1991, 27, 4, 684-690. [all data]