tetrahydro-2,5-dimethylthiophene

Van Den Dool and Kratz RI, polar column, temperature ramp

View large format table.

Column type Active phase I Reference Comment
CapillaryCP-Wax 52CB1197.Yu, Wu, et al., 1989N2, 2. K/min; Column length: 50. m; Column diameter: 0.22 mm; Tstart: 50. C; Tend: 200. C
CapillaryCP-Wax 52CB1197.Yu, Wu, et al., 1989, 2N2, 2. K/min; Column length: 50. m; Column diameter: 0.22 mm; Tstart: 50. C; Tend: 200. C

Normal alkane RI, non-polar column, temperature ramp

View large format table.

Column type Active phase I Reference Comment
CapillaryOV-101881.Limin, Jichun, et al., 198875. C @ 8. min, 2. K/min; Column length: 25. m; Column diameter: 0.25 mm; Tend: 130. C

References

Yu, Wu, et al., 1989
Yu, T.-H.; Wu, C.-M.; Liou, Y.-C., Volatile compounds from garlic, J. Agric. Food Chem., 1989, 37, 3, 725-730, https://doi.org/10.1021/jf00087a032 . [all data]

Yu, Wu, et al., 1989, 2
Yu, T.-H.; Wu, C.-M.; Chen, S.-Y., Effects of pH adjustment and heat treatment on the stability and the formation of volatile compounds of garlic, J. Agric. Food Chem., 1989, 37, 3, 730-734, https://doi.org/10.1021/jf00087a033 . [all data]

Limin, Jichun, et al., 1988
Limin, Z.; Jichun, J.; Shiyi, L.; Keman, S., Identification of sulfur ethers in Jianghan naphtha fractions, Acta Petrolei Sinica, 1988, 4, 1, 100-107. [all data]