α-trans-β-Bergamotene
- Formula: C15H24
- Molecular weight: 204.3511
- IUPAC Standard InChIKey: YMBFCQPIMVLNIU-KFWWJZLASA-N
- Chemical structure:
View 3d structure (requires JavaScript / HTML 5) - Stereoisomers:

Normal alkane RI, non-polar column, temperature ramp

Column type | Active phase | I | Reference | Comment |
---|---|---|---|---|
Capillary | SE-54 | 1496. | Bestmann, Classen, et al., 1988 | N2, 60. C @ 2. min, 6. K/min; Column length: 25. m; Column diameter: 0.25 mm; Tend: 260. C |

References

Bestmann, Classen, et al., 1988
Bestmann, H.-J.; Classen, B.; Kobold, U.; Vostrowsky, O.; Klingauf, F.; Stein, U.,
Steam volatile constituents from leaves of Rhus typhina,
Phytochemistry, 1988, 27, 1, 85-90, https://doi.org/10.1016/0031-9422(88)80595-8
. [all data]