3-Pentyl nitrite
- Formula: C5H11NO2
- Molecular weight: 117.1463
- IUPAC Standard InChIKey: VBLYLPOHOKDRGI-UHFFFAOYSA-N
- Chemical structure:
View 3d structure (requires JavaScript / HTML 5) - Permanent link for this species. Use this link for bookmarking this species for future reference.

Normal alkane RI, non-polar column, temperature ramp

Column type | Active phase | I | Reference | Comment |
---|---|---|---|---|
Capillary | OV-101 | 663. | Zenkevich, 2005 | 25. m/0.20 mm/0.10 μm, N2/He, 6. K/min; Tstart: 50. C; Tend: 250. C |

Normal alkane RI, polar column, custom temperature program

Column type | Active phase | I | Reference | Comment |
---|---|---|---|---|
Packed | Carbowax 6M | 800. | Zenkevich and Malamakhov, 1984 | Nitrogen, Chromaton N AW (0.25-0.315 mm); Column length: 2. m; Program: not specified |

References

Zenkevich, 2005
Zenkevich, I.G.,
Experimentally measured retention indices., 2005. [all data]
Zenkevich and Malamakhov, 1984
Zenkevich, I.G.; Malamakhov, A.S.,
Group Chromato Mass Spectrometric Identification of Alkylnitrites,
Zh. Anal. Khim. (Rus), 1984, 39, 10, 1864-1868. [all data]