7,9-dodecadien-1-ol, acetate
- Formula: C14H24O2
- Molecular weight: 224.3392
- IUPAC Standard InChIKey: LLRZUAWETKPZJO-YTXTXJHMSA-N
- Chemical structure:
View 3d structure (requires JavaScript / HTML 5) - Permanent link for this species. Use this link for bookmarking this species for future reference.

Kovats' RI, non-polar column, isothermal

Column type | Active phase | Temperature (C) | I | Reference | Comment |
---|---|---|---|---|---|
Packed | OV-101 | 130. | 1602. | Berezkin and Returnsky, 1984 | Chromaton N-AW; Column length: 1. m |

References

Berezkin and Returnsky, 1984
Berezkin, V.G.; Returnsky, V.N.,
Calculation of invariant retention indices for a series of aliphatic alcohols and acetates by consideration of adsorption at the interface,
J. Chromatogr., 1984, 292, 1, 9-17, https://doi.org/10.1016/S0021-9673(01)96185-0
. [all data]