2,2-dichloroethyl hexanoate
- Formula: C8H14Cl2O2
- Molecular weight: 213.102
- IUPAC Standard InChIKey: HAARRVFSQRZPDQ-UHFFFAOYSA-N
- Chemical structure:
View 3d structure (requires JavaScript / HTML 5) - Permanent link for this species. Use this link for bookmarking this species for future reference.

Kovats' RI, non-polar column, isothermal

Column type | Active phase | Temperature (C) | I | Reference | Comment |
---|---|---|---|---|---|
Capillary | SE-30 | 140. | 1278. | Korhonen, 1985 | N2; Column length: 25. m; Column diameter: 0.33 mm |
Capillary | SE-30 | 160. | 1282. | Korhonen, 1985 | N2; Column length: 25. m; Column diameter: 0.33 mm |
Capillary | SE-30 | 180. | 1283. | Korhonen, 1985 | N2; Column length: 25. m; Column diameter: 0.33 mm |
Capillary | SE-30 | 200. | 1297. | Korhonen, 1985 | N2; Column length: 25. m; Column diameter: 0.33 mm |

Kovats' RI, polar column, isothermal

Column type | Active phase | Temperature (C) | I | Reference | Comment |
---|---|---|---|---|---|
Capillary | OV-351 | 120. | 1754. | Korhonen, 1985 | N2; Column length: 25. m; Column diameter: 0.32 mm |
Capillary | OV-351 | 140. | 1775. | Korhonen, 1985 | N2; Column length: 25. m; Column diameter: 0.32 mm |
Capillary | OV-351 | 160. | 1758. | Korhonen, 1985 | N2; Column length: 25. m; Column diameter: 0.32 mm |
Capillary | OV-351 | 180. | 1797. | Korhonen, 1985 | N2; Column length: 25. m; Column diameter: 0.32 mm |
Capillary | OV-351 | 200. | 1756. | Korhonen, 1985 | N2; Column length: 25. m; Column diameter: 0.32 mm |

Van Den Dool and Kratz RI, non-polar column, temperature ramp

Column type | Active phase | I | Reference | Comment |
---|---|---|---|---|
Capillary | SE-30 | 1289. | Korhonen, 1985 | N2, 6. K/min; Column length: 25. m; Column diameter: 0.33 mm; Tstart: 100. C; Tend: 320. C |

Van Den Dool and Kratz RI, polar column, temperature ramp

Column type | Active phase | I | Reference | Comment |
---|---|---|---|---|
Capillary | OV-351 | 1765. | Korhonen, 1985 | N2, 6. K/min; Column length: 25. m; Column diameter: 0.32 mm; Tstart: 100. C; Tend: 230. C |

References

Korhonen, 1985
Korhonen, I.O.O.,
Gas-liquid chromatographic analyses. XLIII. Retention increments for 2-chloro-, 2,2-dichloro- and 2,2,2-trichloroethyl esters of aliphatic C2-C20 n-alkanoic acids on SE-30 and OV-351 capillary columns,
J. Chromatogr., 1985, 329, 43-56, https://doi.org/10.1016/S0021-9673(01)81894-X
. [all data]