2,2-dichloroethyl hexadecanoate
- Formula: C18H34Cl2O2
- Molecular weight: 353.367
- IUPAC Standard InChIKey: KHCNMQCCZLLSQF-UHFFFAOYSA-N
- Chemical structure:
View 3d structure (requires JavaScript / HTML 5) - Permanent link for this species. Use this link for bookmarking this species for future reference.

Kovats' RI, non-polar column, isothermal

Column type | Active phase | Temperature (C) | I | Reference | Comment |
---|---|---|---|---|---|
Capillary | SE-30 | 200. | 2293. | Korhonen, 1985 | N2; Column length: 25. m; Column diameter: 0.33 mm |
Capillary | SE-30 | 220. | 2301. | Korhonen, 1985 | N2; Column length: 25. m; Column diameter: 0.33 mm |

Kovats' RI, polar column, isothermal

Column type | Active phase | Temperature (C) | I | Reference | Comment |
---|---|---|---|---|---|
Capillary | OV-351 | 160. | 2765. | Korhonen, 1985 | N2; Column length: 25. m; Column diameter: 0.32 mm |
Capillary | OV-351 | 180. | 2781. | Korhonen, 1985 | N2; Column length: 25. m; Column diameter: 0.32 mm |
Capillary | OV-351 | 200. | 2785. | Korhonen, 1985 | N2; Column length: 25. m; Column diameter: 0.32 mm |
Capillary | OV-351 | 220. | 2792. | Korhonen, 1985 | N2; Column length: 25. m; Column diameter: 0.32 mm |

Van Den Dool and Kratz RI, non-polar column, temperature ramp

Column type | Active phase | I | Reference | Comment |
---|---|---|---|---|
Capillary | SE-30 | 2301. | Korhonen, 1985 | N2, 6. K/min; Column length: 25. m; Column diameter: 0.33 mm; Tstart: 100. C; Tend: 320. C |

Van Den Dool and Kratz RI, polar column, temperature ramp

Column type | Active phase | I | Reference | Comment |
---|---|---|---|---|
Capillary | OV-351 | 2780. | Korhonen, 1985 | N2, 6. K/min; Column length: 25. m; Column diameter: 0.32 mm; Tstart: 100. C; Tend: 230. C |

References

Korhonen, 1985
Korhonen, I.O.O.,
Gas-liquid chromatographic analyses. XLIII. Retention increments for 2-chloro-, 2,2-dichloro- and 2,2,2-trichloroethyl esters of aliphatic C2-C20 n-alkanoic acids on SE-30 and OV-351 capillary columns,
J. Chromatogr., 1985, 329, 43-56, https://doi.org/10.1016/S0021-9673(01)81894-X
. [all data]