O-methylated salsolinol, TMS

Kovats' RI, non-polar column, isothermal

View large format table.

Column type Active phase Temperature (C) I Reference Comment
PackedOV-1190.1910.Cashaw, Walsh, et al., 1971N2, GasChrom Q; Column length: 2. m

References

Cashaw, Walsh, et al., 1971
Cashaw, J.L.; Walsh, M.J.; Yamanaka, Y.; Davis, V.E., Simultaneous determination of biogenic amines and narcotic alkaloids by gas-liquid chromatography, J. Chromatogr. Sci., 1971, 9, 2, 98-104, https://doi.org/10.1093/chromsci/9.2.98 . [all data]