2-methyleneadamantane
- Formula: C11H16
- Molecular weight: 148.2447
- IUPAC Standard InChIKey: JTCQPLINQYIRDZ-UHFFFAOYSA-N
- Chemical structure:
View 3d structure (requires JavaScript / HTML 5) - Species with the same structure:

Kovats' RI, non-polar column, isothermal

Column type | Active phase | Temperature (C) | I | Reference | Comment |
---|---|---|---|---|---|
Capillary | SE-30 | 145. | 1160. | Burkhard, Vais, et al., 1969 | N2; Column length: 50. m; Column diameter: 0.27 mm |
Capillary | SE-30 | 160. | 1173. | Burkhard, Vais, et al., 1969 | N2; Column length: 50. m; Column diameter: 0.27 mm |
Capillary | SE-30 | 175. | 1181. | Burkhard, Vais, et al., 1969 | N2; Column length: 50. m; Column diameter: 0.27 mm |
Capillary | SE-30 | 190. | 1197. | Burkhard, Vais, et al., 1969 | N2; Column length: 50. m; Column diameter: 0.27 mm |

Kovats' RI, polar column, isothermal

Column type | Active phase | Temperature (C) | I | Reference | Comment |
---|---|---|---|---|---|
Capillary | Carbowax 20M | 145. | 1388. | Burkhard, Vais, et al., 1969 | N2; Column length: 50. m; Column diameter: 0.27 mm |
Capillary | Carbowax 20M | 160. | 1407. | Burkhard, Vais, et al., 1969 | N2; Column length: 50. m; Column diameter: 0.27 mm |
Capillary | Carbowax 20M | 175. | 1429. | Burkhard, Vais, et al., 1969 | N2; Column length: 50. m; Column diameter: 0.27 mm |

References

Burkhard, Vais, et al., 1969
Burkhard, J.; Vais, J.; Vodicka, L.; Landa, S.,
Adamantane and its derivatives. XVI. The gas chromatographic characterization of adamantane derivatives,
J. Chromatogr., 1969, 42, 207-218, https://doi.org/10.1016/S0021-9673(01)80617-8
. [all data]