cis-β-Elemene diastereomer
- Formula: C15H24
- Molecular weight: 204.3511
- IUPAC Standard InChIKey: OPFTUNCRGUEPRZ-KKUMJFAQSA-N
- Chemical structure:
View 3d structure (requires JavaScript / HTML 5) - Stereoisomers:
- Elemene
- Cyclohexane, 1-ethenyl-1-methyl-2,4-bis(1-methylethenyl)-, (1α,2β,4β)-
- Cyclohexane, 1-ethenyl-1-methyl-2,4-bis(1-methylethenyl)-, [1S-(1α,2β,4β)]-
- (Z)-β-Elemene
- (E)-β-Elemene
- (-)-(5R,7S,10S)-cis-β-Elemene
- (5S,7S,10R)-cis-β-Elemene, diastereomer
- 1-Ethenyl-1-methyl-2,4-bis-(1-methylethenyl)cyclohexane
- τ-Elemene

Van Den Dool and Kratz RI, non-polar column, custom temperature program

Column type | Active phase | I | Reference | Comment |
---|---|---|---|---|
Capillary | CP Sil 5 CB | 1387. | Adio, Paul, et al., 2004 | H2; Column length: 25. m; Program: not specified |

References

Adio, Paul, et al., 2004
Adio, A.M.; Paul, C.; Kloth, P.; König, W.A.,
Sesquiterpenes of the liverwort Scapania undulata,
Phytochemistry, 2004, 65, 2, 199-206, https://doi.org/10.1016/j.phytochem.2003.10.018
. [all data]