Helminthogermacrene
- Formula: C15H24
- Molecular weight: 204.3511
- IUPAC Standard InChIKey: XMRKUJJDDKYUHV-SOMPWSNVSA-N
- Chemical structure:
View 3d structure (requires JavaScript / HTML 5) - Species with the same structure:
- Stereoisomers:
- Other names: (+)-Helminthogermacrene

Van Den Dool and Kratz RI, non-polar column, custom temperature program

Column type | Active phase | I | Reference | Comment |
---|---|---|---|---|
Capillary | CP Sil 5 CB | 1503. | Adio, Paul, et al., 2004 | H2; Column length: 25. m; Program: not specified |

References

Adio, Paul, et al., 2004
Adio, A.M.; Paul, C.; Kloth, P.; König, W.A.,
Sesquiterpenes of the liverwort Scapania undulata,
Phytochemistry, 2004, 65, 2, 199-206, https://doi.org/10.1016/j.phytochem.2003.10.018
. [all data]