(Z)-β-Damascenone
- Formula: C13H18O
- Molecular weight: 190.2814
- IUPAC Standard InChIKey: POIARNZEYGURDG-ALCCZGGFSA-N
- Chemical structure:
View 3d structure (requires JavaScript / HTML 5) - Species with the same structure:
- Stereoisomers:
- Other names: cis-β-Damascenone

Kovats' RI, non-polar column, custom temperature program

Column type | Active phase | I | Reference | Comment |
---|---|---|---|---|
Capillary | HP-5 | 1359. | Palic, Stojanovic, et al., 2002 | 30. m/0.25 mm/0.25 μm, He; Program: 50 C 20 C/min -> 70 C 9 C/min -> 280 C |
Capillary | HP-5 | 1359. | Stojanovic, Palic, et al., 2000 | 30. m/0.25 mm/0.25 μm, He; Program: 50 0C 20 K/min -> 70 0C 9 K/min -> 280 0C |

Van Den Dool and Kratz RI, non-polar column, temperature ramp

Column type | Active phase | I | Reference | Comment |
---|---|---|---|---|
Capillary | HP-5 | 1382. | Quijano, Salamanca, et al., 2007 | 30. m/0.25 mm/0.25 μm, He, 50. C @ 4. min, 4. K/min, 250. C @ 10. min |
Capillary | DB-1 | 1356. | Dob, Dahmane, et al., 2005 | 30. m/0.32 mm/0.25 μm, 50. C @ 8. min, 2. K/min; Tend: 250. C |
Capillary | HP-5 | 1380. | Lazari, Skaltsa, et al., 2000 | 30. m/0.25 mm/0.25 μm, He, 50. C @ 5. min, 4. K/min; Tend: 280. C |

Normal alkane RI, non-polar column, temperature ramp

Column type | Active phase | I | Reference | Comment |
---|---|---|---|---|
Capillary | HP-5MS | 1347. | Ferhat, Tigrine-Kordjani, et al., 2007 | 30. m/0.25 mm/0.25 μm, He, 60. C @ 8. min, 2. K/min, 250. C @ 15. min |
Capillary | DB-5 | 1367. | Morteza-Semnani and Saeedi, 2005 | 30. m/0.25 mm/0.25 μm, He, 60. C @ 4. min, 4. K/min; Tend: 220. C |
Capillary | SPB-5 | 1361. | Pino, Marbot, et al., 2005 | 30. m/0.25 mm/0.25 μm, He, 60. C @ 2. min, 4. K/min, 250. C @ 20. min |
Capillary | DB-5 | 1359. | Kobaisy, Tellez, et al., 2002 | 30. m/0.25 mm/0.25 μm, He, 3. K/min; Tstart: 60. C; Tend: 240. C |

Normal alkane RI, polar column, temperature ramp

Column type | Active phase | I | Reference | Comment |
---|---|---|---|---|
Capillary | Carbowax | 1752. | Ferhat, Tigrine-Kordjani, et al., 2007 | 60. m/0.2 mm/0.25 μm, He, 60. C @ 8. min, 2. K/min, 250. C @ 15. min |
Capillary | Stabilwax | 1791. | Jirovetz, Buchbauer, et al., 2005 | 30. m/0.32 mm/0.5 μm, 40. C @ 5. min, 6. K/min, 280. C @ 5. min |
Capillary | Carbowax 20M | 1728. | Kawakami, Kobayashi, et al., 1993 | He, 60. C @ 4. min, 2. K/min; Column length: 50. m; Column diameter: 0.25 mm; Tend: 180. C |

References

Palic, Stojanovic, et al., 2002
Palic, R.; Stojanovic, G.; Alagic, S.; Nikolic M.; Lepojevic, Z.,
Chemical composition and antimicrobial activity of the essential oil and CO2 extracts of the oriental tobacco, Prilep,
Flavour Fragr. J., 2002, 17, 5, 323-326, https://doi.org/10.1002/ffj.1084
. [all data]
Stojanovic, Palic, et al., 2000
Stojanovic, G.; Palic, R.; Alagic, S.; Zekovic, Z.,
Chemical composition and antimicrobial activity of the essential oil and CO2 extracts of semi-oriental tobacco, Otlja,
Flavour Fragr. J., 2000, 15, 5, 335-338, https://doi.org/10.1002/1099-1026(200009/10)15:5<335::AID-FFJ921>3.0.CO;2-W
. [all data]
Quijano, Salamanca, et al., 2007
Quijano, C.E.; Salamanca, G.; Pino, J.A.,
Aroma volatile constituents of Colombian varieties of mango (Mangifera indica L.),
Flavour Fragr. J., 2007, 22, 5, 401-406, https://doi.org/10.1002/ffj.1812
. [all data]
Dob, Dahmane, et al., 2005
Dob, T.; Dahmane, D.; Berramdane, T.; Chelghoum, C.,
Chemical composition of the essential oil of Artemisia campestris L. from Algeria,
Pharm. Biol., 2005, 43, 6, 512-514, https://doi.org/10.1080/13880200500220664
. [all data]
Lazari, Skaltsa, et al., 2000
Lazari, D.M.; Skaltsa, H.D.; Constantinidis, T.,
Volatile constituents of Centaurea pelia DC., C. thessala Hausskn. subsp. drakiensis (Freyn Sint.) Georg. and C. zuccariniana DC. from Greece,
Flavour Fragr. J., 2000, 15, 1, 7-11, https://doi.org/10.1002/(SICI)1099-1026(200001/02)15:1<7::AID-FFJ860>3.0.CO;2-3
. [all data]
Ferhat, Tigrine-Kordjani, et al., 2007
Ferhat, M.A.; Tigrine-Kordjani, N.; Chemat, S.; Meklati, B.Y.; Chemat, F.,
Rapid Extraction of Volatile Compounds Using a New Simultaneous Microwave Distillation: Solvent Extraction Device,
Chromatographia, 2007, 65, 3-4, 217-222, https://doi.org/10.1365/s10337-006-0130-5
. [all data]
Morteza-Semnani and Saeedi, 2005
Morteza-Semnani, K.; Saeedi, M.,
The essential oil composition of Phlomis bruguieri Desf. from Iran,
Flavour Fragr. J., 2005, 20, 3, 344-346, https://doi.org/10.1002/ffj.1459
. [all data]
Pino, Marbot, et al., 2005
Pino, J.A.; Marbot, R.; Rosado, A.; Vázquez, C.,
Volatile constituents of genipap (Genipa americana L.) fruit from Cuba,
Flavour Fragr. J., 2005, 20, 6, 583-586, https://doi.org/10.1002/ffj.1491
. [all data]
Kobaisy, Tellez, et al., 2002
Kobaisy, M.; Tellez, M.R.; Dayan, F.E.; Duke, S.O.,
Phytotoxicity and volatile constituents from leaves of Callicarpa japonica Thunb.,
Phytochemistry, 2002, 61, 1, 37-40, https://doi.org/10.1016/S0031-9422(02)00207-8
. [all data]
Jirovetz, Buchbauer, et al., 2005
Jirovetz, L.; Buchbauer, G.; Stoyanova, A.; Balinova, A.; Guangjiun, Z.; Xihan, M.,
Solid phase microextraction/gas chromatographic and olfactory analysis of the scent and fixative properties of the essential oil of Rosa damascena L. from China,
Flavour Fragr. J., 2005, 20, 1, 7-12, https://doi.org/10.1002/ffj.1375
. [all data]
Kawakami, Kobayashi, et al., 1993
Kawakami, M.; Kobayashi, A.; Kator, K.,
Volatile constituents of Rooibos tea (Aspalathus linearis) as affected by extraction process,
J. Agric. Food Chem., 1993, 41, 4, 633-636, https://doi.org/10.1021/jf00028a023
. [all data]