cis (trans,cis)-Bicyclo[10.1.0]trideca-4,8-diene
- Formula: C15H24
- Molecular weight: 204.3511
- IUPAC Standard InChIKey: PFXKPLMGASGUIW-DVJYWQQMSA-N
- Chemical structure:
View 3d structure (requires JavaScript / HTML 5) - Other names: (Z,E,Z)-Bicyclo[10.1.0]trideca-4,8-diene

Kovats' RI, non-polar column, isothermal

Column type | Active phase | Temperature (C) | I | Reference | Comment |
---|---|---|---|---|---|
Capillary | Squalane | 120. | 1405. | Schomburg, 1967 | Ar; Column length: 100. m |

References

Schomburg, 1967
Schomburg, G.,
Struktur und Retentionsverhalten von Offenkettigen und Cyclischen Kohlenwasserstoffen und Deren Einfacher Substitutionsprodukte,
Anal. Chim. Acta., 1967, 38, 45-64, https://doi.org/10.1016/S0003-2670(01)80560-2
. [all data]