3,5-Dimethylheptane, (L)
- Formula: C9H20
- Molecular weight: 128.2551
- IUPAC Standard InChIKey: DZJTZGHZAWTWGA-RKDXNWHRSA-N
- Chemical structure:
View 3d structure (requires JavaScript / HTML 5) - Species with the same structure:
- Stereoisomers:

Van Den Dool and Kratz RI, non-polar column, temperature ramp

Column type | Active phase | I | Reference | Comment |
---|---|---|---|---|
Capillary | PONA | 828.6 | Martos, Saraullo, et al., 1997 | 50. m/0.2 mm/0.5 μm, 35. C @ 0.5 min, 1. K/min, 220. C @ 8. min |
Capillary | PONA | 834.6 | Martos, Saraullo, et al., 1997 | 50. m/0.2 mm/0.5 μm, 35. C @ 0.5 min, 1. K/min, 220. C @ 8. min |

References

Martos, Saraullo, et al., 1997
Martos, P.A.; Saraullo, A.; Pawliszyn, J.,
Estimation of air/coating distribution coefficients for solid phase microextraction using retention indexes from linear temperature-programmed capillary gas chromatography. Application to the sampling and analysis of total petroleum hydrocarbons in air,
Anal. Chem., 1997, 69, 3, 402-408, https://doi.org/10.1021/ac960633p
. [all data]