δ-Fenchene
- Formula: C10H16
- Molecular weight: 136.2340
- IUPAC Standard InChIKey: FUIDRYCKEXJNOK-UHFFFAOYSA-N
- Chemical structure:
View 3d structure (requires JavaScript / HTML 5) - Species with the same structure:
- Stereoisomers:

Normal alkane RI, non-polar column, custom temperature program

Column type | Active phase | I | Reference | Comment |
---|---|---|---|---|
Capillary | SE-30 | 869. | Vinogradov, 2004 | Program: not specified |
Capillary | DB-5 | 864. | Isidorov, Zenkevich, et al., 1997 | Program: not specified |
Capillary | Methyl Silicone | 869. | Zenkevich, 1996 | Program: not specified |

References

Vinogradov, 2004
Vinogradov, B.A.,
Production, composition, properties and application of essential oils, 2004, retrieved from http://viness.narod.ru. [all data]
Isidorov, Zenkevich, et al., 1997
Isidorov, V.; Zenkevich, I.; Sacharevich, T.,
Calculation of Gas Chromatographic Retention Indices for Monoterpenes and Terpenoids from Their Physico-Chemical Constants,
Chem. Anal. (Warsaw), 1997, 42, 627-634. [all data]
Zenkevich, 1996
Zenkevich, I.G.,
Analytical Parameters of Components of Essential Oils for their Chromatographic and Chromato-Mass Spectral Identification. Mono- and Sesquiterpenes,
Rastitelnye Resursy (Plant resources), 1996, 34, 1-2, 48-58. [all data]