Dibenzofuran, 3,4,6,7-tetrachloro

Normal alkane RI, non-polar column, custom temperature program

Data compiled by: NIST Mass Spectrometry Data Center, William E. Wallace, director

Column type Capillary
Active phase DB-5
Column length (m)
Carrier gas
Substrate
Column diameter (mm)
Phase thickness (μm)
Program not specified
I 2362.
ReferenceN/A
Comment MSDC-RI

References

No reference data available.