cis-4-Hepten-2-one
- Formula: C7H12O
- Molecular weight: 112.1696
- IUPAC Standard InChIKey: VQKIKHHXFHNXJT-PLNGDYQASA-N
- Chemical structure:
View 3d structure (requires JavaScript / HTML 5) - Stereoisomers:
- Other names: (Z)-4-hepten-2-one

Normal alkane RI, non-polar column, temperature ramp

Column type | Active phase | I | Reference | Comment |
---|---|---|---|---|
Capillary | DB-1 | 868. | Shiota, 1993 | 30. m/0.25 mm/0.25 μm, He, 50. C @ 3. min, 5. K/min; Tend: 240. C |
Capillary | DB-1 | 874. | Shiota, 1993 | 30. m/0.25 mm/0.25 μm, He, 50. C @ 3. min, 5. K/min; Tend: 240. C |

Normal alkane RI, polar column, temperature ramp

Column type | Active phase | I | Reference | Comment |
---|---|---|---|---|
Capillary | Carbowax 20M | 1230. | Buttery and Ling, 1984 | 60. C @ 40. min, 1. K/min; Column length: 150. m; Column diameter: 0.66 mm; Tend: 170. C |

References

Shiota, 1993
Shiota, H.,
New esteric components in the volatiles of banana fruit (Musa sapientum L.),
J. Agric. Food Chem., 1993, 41, 11, 2056-2062, https://doi.org/10.1021/jf00035a046
. [all data]
Buttery and Ling, 1984
Buttery, R.G.; Ling, L.C.,
Corn leaf volatiles: identification using Tenax trapping for possible insect attractants,
J. Agric. Food Chem., 1984, 32, 5, 1104-1106, https://doi.org/10.1021/jf00125a044
. [all data]