2-Propenoic acid, 3-(3,4-dimethoxyphenyl)-, methyl ester, trans
- Formula: C12H14O4
- Molecular weight: 222.2372
- IUPAC Standard InChIKey: JXRYDOZRPYFBKO-FNORWQNLSA-N
- Chemical structure:
View 3d structure (requires JavaScript / HTML 5) - Species with the same structure:
- Stereoisomers:

Normal alkane RI, non-polar column, custom temperature program

Column type | Active phase | I | Reference | Comment |
---|---|---|---|---|
Capillary | DB-1 | 1835. | Marlatt, Ho, et al., 1992 | 30. m/0.25 mm/0.25 μm; Program: not specified |

References

Marlatt, Ho, et al., 1992
Marlatt, C.; Ho, C.-T.; Chien, M.,
Studies of aroma constituents bound as glycosides in tomato,
J. Agric. Food Chem., 1992, 40, 2, 249-252, https://doi.org/10.1021/jf00014a016
. [all data]