Dicyclopentadiene, exo
- Formula: C10H12
- Molecular weight: 132.2023
- IUPAC Standard InChIKey: HECLRDQVFMWTQS-XFWSIPNHSA-N
- Chemical structure:
View 3d structure (requires JavaScript / HTML 5) - Stereoisomers:
- Other names: exo-Dicyclopentadiene

Kovats' RI, non-polar column, isothermal

Column type | Active phase | Temperature (C) | I | Reference | Comment |
---|---|---|---|---|---|
Capillary | OV-101 | 100. | 1015. | Diez, Guillen, et al., 1990 | N2; Column length: 25. m; Column diameter: 0.23 mm |
Capillary | OV-101 | 80. | 1007. | Diez, Guillen, et al., 1990 | N2; Column length: 25. m; Column diameter: 0.23 mm |
Capillary | Squalane | 100. | 1003.3 | Diez, Guillen, et al., 1990 | N2; Column length: 45. m; Column diameter: 0.5 mm |
Capillary | Squalane | 80. | 996.6 | Diez, Guillen, et al., 1990 | N2; Column length: 45. m; Column diameter: 0.5 mm |
Capillary | SE-54 | 100. | 1032.8 | Diez, Guillen, et al., 1990 | N2; Column length: 25. m; Column diameter: 0.22 mm |
Capillary | SE-54 | 80. | 1022.4 | Diez, Guillen, et al., 1990 | N2; Column length: 25. m; Column diameter: 0.22 mm |
Capillary | Squalane | 64. | 986. | Sojak, Ruman, et al., 1987 | 50. m/0.25 mm/0.25 μm, H2 |
Capillary | Squalane | 60. | 984. | Stopp, Engewald, et al., 1978 | Column length: 70. m; Column diameter: 0.23 mm |

Normal alkane RI, non-polar column, isothermal

Column type | Active phase | Temperature (C) | I | Reference | Comment |
---|---|---|---|---|---|
Capillary | Squalane | 104. | 1007. | Bermejo, Blanco, et al., 1983 | N2; Column length: 50. m; Column diameter: 0.25 mm |

References

Diez, Guillen, et al., 1990
Diez, M.A.; Guillen, M.D.; Blanco, C.G.; Bermejo, J.,
Chromatographic study of methylcyclopentadiene dimers and iso-dimers and determination of their boiling points,
J. Chromatogr., 1990, 508, 363-374, https://doi.org/10.1016/S0021-9673(00)91279-2
. [all data]
Sojak, Ruman, et al., 1987
Sojak, L.; Ruman, J.; Janak, J.,
Characterization of Monoalkylcyclopentadiens by Retention-Structure Correlation in Capillary Gas Chromatography,
J. Chromatogr., 1987, 391, 79-87, https://doi.org/10.1016/S0021-9673(01)94306-7
. [all data]
Stopp, Engewald, et al., 1978
Stopp, I.; Engewald, W.; Kühn, H.; Welsch, Th.,
Molekülstruktur und retentionsverhalten. VIII. Zum gaschromatographischen retentionsverhalten von dicyclopentadienderivaten,
J. Chromatogr., 1978, 147, 21-30, https://doi.org/10.1016/S0021-9673(00)85113-4
. [all data]
Bermejo, Blanco, et al., 1983
Bermejo, J.; Blanco, C.G.; Diez, M.A.; Suarez Canga, J.,
Identification of methyl and dimethyl derivatives of dicyclopentadiene,
AFINIDAD, 1983, 40, 386, 320-326. [all data]