Hexane, 2,3,4,5-tetramethyl-, erythro
- Formula: C10H22
- Molecular weight: 142.2817
- IUPAC Standard InChIKey: BHGNYYIOYPFWKC-AOOOYVTPSA-N
- Chemical structure:
View 3d structure (requires JavaScript / HTML 5) - Stereoisomers:

Kovats' RI, non-polar column, custom temperature program

Column type | Active phase | I | Reference | Comment |
---|---|---|---|---|
Capillary | Squalane | 916. | Korol and Lysyuk, 1980 | Program: not specified |

References

Korol and Lysyuk, 1980
Korol, A.N.; Lysyuk, L.S.,
A New Thermodynamic Method for Calculating the Retention Indices of Isoalkanes on Squalane,
Theor. Exp. Chem. (Engl. Transl.), 1980, 6, 577-584. [all data]