Butane, 2-bromo-3-methoxy, erythro

Kovats' RI, non-polar column, isothermal

View large format table.

Column type Active phase Temperature (C) I Reference Comment
CapillarySqualane115.818.Lafosse and Thuaud-Chourrout, 1975Column length: 100. m; Column diameter: 0.25 mm

References

Lafosse and Thuaud-Chourrout, 1975
Lafosse, M.; Thuaud-Chourrout, N., Etude du comportement de composés halogénés et mèthoxylés en CG dans le cas de quatre phases stationnaires liquides pouvant former des liaisons de type donneur-accepteur d'électrons avec les groupes fonctionnels de ces composés, Chromatographia, 1975, 8, 4, 195-202, https://doi.org/10.1007/BF02274456 . [all data]