Butane, 2,3-dibromo-, threo
- Formula: C4H8Br2
- Molecular weight: 215.914
- IUPAC Standard InChIKey: BXXWFOGWXLJPPA-IMJSIDKUSA-N
- Chemical structure:
View 3d structure (requires JavaScript / HTML 5) - Stereoisomers:

Kovats' RI, non-polar column, isothermal

Column type | Active phase | Temperature (C) | I | Reference | Comment |
---|---|---|---|---|---|
Capillary | Squalane | 115. | 930. | Lafosse and Thuaud-Chourrout, 1975 | Column length: 100. m; Column diameter: 0.25 mm |

References

Lafosse and Thuaud-Chourrout, 1975
Lafosse, M.; Thuaud-Chourrout, N.,
Etude du comportement de composés halogénés et mèthoxylés en CG dans le cas de quatre phases stationnaires liquides pouvant former des liaisons de type donneur-accepteur d'électrons avec les groupes fonctionnels de ces composés,
Chromatographia, 1975, 8, 4, 195-202, https://doi.org/10.1007/BF02274456
. [all data]