2-(4-Allyl-2,6-dimethoxy-phenoxy)-1 -(3,4-dimethoxy-phenyl)-propan-1-ol, TMS
- Formula: C25H36O6Si
- Molecular weight: 460.6352
- IUPAC Standard InChIKey: PGPFNHBPJKCGHV-UHFFFAOYSA-N
- Chemical structure:

Normal alkane RI, non-polar column, temperature ramp

Column type | Active phase | I | Reference | Comment |
---|---|---|---|---|
Packed | SE-30 | 2655. | Harvey, 1975 | N2, Gas-Chrom Q, 4. K/min, 330. C @ 30. min; Column length: 2. m; Tstart: 150. C |

References

Harvey, 1975
Harvey, D.J.,
Examination of the diphenylpropanoids of nutmeg as their trimethylsilyl, triethylsilyl and tri-n-propylsilyl derivatives using combined gas chromatography and mass spectrometry,
J. Chromatogr., 1975, 110, 1, 91-102, https://doi.org/10.1016/S0021-9673(00)91214-7
. [all data]