Cyclooctane, 1,2-diethyl-, cis
- Formula: C12H24
- Molecular weight: 168.3190
- IUPAC Standard InChIKey: XDADRYBKGCGTEX-TXEJJXNPSA-N
- Chemical structure:
View 3d structure (requires JavaScript / HTML 5) - Stereoisomers:

Kovats' RI, non-polar column, isothermal

Column type | Active phase | Temperature (C) | I | Reference | Comment |
---|---|---|---|---|---|
Capillary | Squalane | 79. | 1013. | Engewald, Graefe, et al., 1974 | N2; Column length: 120. m; Column diameter: 0.20 mm |

References

Engewald, Graefe, et al., 1974
Engewald, W.; Graefe, J.; Kiselev, A.V.; Shcherbakova, K.D.; Welsch, Th.,
Molekülstruktur und Retentionsverhalten. I. Strukturelle Zuordnung von thermischen Umlagerungsprodukten der Cyclododecatriene-(1.5.9) mittels Gas-Adsorptions-Chromatographie,
Chromatographia, 1974, 7, 5, 229-235, https://doi.org/10.1007/BF02321773
. [all data]