1,3,7-Octatriene, E
- Formula: C8H12
- Molecular weight: 108.1809
- IUPAC Standard InChIKey: ZTJHDEXGCKAXRZ-FNORWQNLSA-N
- Chemical structure:
View 3d structure (requires JavaScript / HTML 5) - Stereoisomers:

Kovats' RI, non-polar column, isothermal

Column type | Active phase | Temperature (C) | I | Reference | Comment |
---|---|---|---|---|---|
Capillary | Squalane | 30. | 788. | Döring, Estel, et al., 1974 | Column length: 150. m; Column diameter: 0.25 mm |

References

Döring, Estel, et al., 1974
Döring, C.-E.; Estel, D.; Geyer, R.; Wendt, W.-H.,
Kapillargaschromatographische Analyse geradkettiger C8-Diene,
Z. Chem., 1974, 14, 7, 292-293, https://doi.org/10.1002/zfch.19740140730
. [all data]