Dibenzofuran, 1,2,7,9-tetrachloro
- Formula: C12H4Cl4O
- Molecular weight: 305.972
- IUPAC Standard InChIKey: PDMFRPIFZAKMLH-UHFFFAOYSA-N
- Chemical structure:
View 3d structure (requires JavaScript / HTML 5) - Other names: 1,2,7,9-tetrachlorodibenzofuran

Van Den Dool and Kratz RI, non-polar column, temperature ramp

Column type | Active phase | I | Reference | Comment |
---|---|---|---|---|
Capillary | DB-5 | 2341. | Hale, Hileman, et al., 1985 | He, 175. C @ 1. min, 6. K/min; Column length: 30. m; Tend: 180. C |

Van Den Dool and Kratz RI, non-polar column, custom temperature program

Column type | Active phase | I | Reference | Comment |
---|---|---|---|---|
Capillary | HP-5 | 2338. | Korhonen and Mantykoski, 1989 | 25. m/0.20 mm/0.11 μm, He; Program: 100 0C (1 min) 20 0C/min -> 180 0C 5 0C/min -> 290 0C (until elution of the last peak) |

Normal alkane RI, non-polar column, custom temperature program

Column type | Active phase | I | Reference | Comment |
---|---|---|---|---|
Capillary | DB-5 | 2341. | N/A | Program: not specified |

References

Hale, Hileman, et al., 1985
Hale, M.D.; Hileman, F.D.; Mazer, T.; Shell, T.L.; Noble, R.W.; Brooks, J.J.,
Mathematical modeling of temperature programmed capillary gas chromatographic retention indexes for polychlorinated dibenzofurans,
Anal. Chem., 1985, 57, 3, 640-648, https://doi.org/10.1021/ac00280a017
. [all data]
Korhonen and Mantykoski, 1989
Korhonen, I.O.O.; Mantykoski, K.M.,
Gas-Liquid Chromatographic Analyses. L. Retention, Dispersion and Selectivity Indices of Polychlorinated Dibenzo-p-dioxins and Dibenzofurans,
J. Chromatogr., 1989, 477, 2, 327-336, https://doi.org/10.1016/S0021-9673(01)89641-2
. [all data]