3,4-Dimethyloctane, erythro
- Formula: C10H22
- Molecular weight: 142.2817
- IUPAC Standard InChIKey: QQCWGAMGBCGAQJ-VHSXEESVSA-N
- Chemical structure:
View 3d structure (requires JavaScript / HTML 5) - Stereoisomers:
- Other names: Octane, 3,4-dimethyl-, erythro

Kovats' RI, non-polar column, isothermal

Column type | Active phase | Temperature (C) | I | Reference | Comment |
---|---|---|---|---|---|
Capillary | Vacuum Grease Oil (VM-4) | 95. | 936.3 | Sultanov and Arustamova, 1975 | N2; Column length: 150. m; Column diameter: 0.25 mm |
Capillary | Squalane | 80. | 953. | Schomburg, 1967 | Ar; Column length: 100. m |

Kovats' RI, non-polar column, custom temperature program

Column type | Active phase | I | Reference | Comment |
---|---|---|---|---|
Capillary | Squalane | 935. | Korol and Lysyuk, 1980 | Program: not specified |

References

Sultanov and Arustamova, 1975
Sultanov, N.T.; Arustamova, L.G.,
Determination of the boiling points of C10 isoalkanes in an n-decane isomerizate from gas chromatographic retention indices,
J. Chromatogr., 1975, 115, 2, 553-558, https://doi.org/10.1016/S0021-9673(01)98959-9
. [all data]
Schomburg, 1967
Schomburg, G.,
Struktur und Retentionsverhalten von Offenkettigen und Cyclischen Kohlenwasserstoffen und Deren Einfacher Substitutionsprodukte,
Anal. Chim. Acta., 1967, 38, 45-64, https://doi.org/10.1016/S0003-2670(01)80560-2
. [all data]
Korol and Lysyuk, 1980
Korol, A.N.; Lysyuk, L.S.,
A New Thermodynamic Method for Calculating the Retention Indices of Isoalkanes on Squalane,
Theor. Exp. Chem. (Engl. Transl.), 1980, 6, 577-584. [all data]