(E)-4-Methylhept-3-ene

Kovats' RI, non-polar column, isothermal

Data compiled by: NIST Mass Spectrometry Data Center, William E. Wallace, director

Column type CapillaryCapillaryCapillary
Active phase Petrocol DHSqualaneSqualane
Column length (m) 150.93.91.4
Carrier gas H2HeN2
Substrate
Column diameter (mm) 0.250.250.25
Phase thickness (μm) 1.
Temperature (C) 30.30.40.
I 791.3778.779.
ReferenceSoják, Addová, et al., 2004Soják, Addová, et al., 2004Matukuma, 1969
Comment MSDC-RI MSDC-RI MSDC-RI

References

Soják, Addová, et al., 2004
Soják, L.; Addová, G.; Kubinec, R.; Kraus, A.; Bohác, A., Capillary gas chromatography-mass spectrometry of all 93 acyclic octenes and their identification in fluid catalytic cracked gasoline, J. Chromatogr. A, 2004, 1025, 2, 237-253, https://doi.org/10.1016/j.chroma.2003.10.112 . [all data]

Matukuma, 1969
Matukuma, A., Retention indices of alkanes through C10 and alkenes through C8 and relation between boiling points and retention data, Gas Chromatogr., Int. Symp. Anal. Instrum. Div Instrum Soc. Amer., 1969, 7, 55-75. [all data]